{"text_format":"1","workbook":"xlsx","n_sheets":9,"sheets":["Intro","Raw Scores","Summary Scores","Top Issues","Improvement Potential","IP Rankings","Recommendations","Innovation Survey","Sheet1"],"not_rendered":{"charts":1,"images":1,"macros":1,"external_links":0,"defined_names":12,"comments":0,"pivot_tables":0},"unopened":[],"bounds":{"document_bytes":16777216,"sheet_cells":100000,"rows_first":2000,"rows_last":500,"rows_between":2000,"halvings":0,"cell_chars":16384,"cell_head_chars":4096},"cells_cut":0,"cells_raw":0,"read":"whole","date_system":"1900"}

{"sheet":"Intro","index":0,"n_rows":32,"n_cols":1,"rows_kept":32,"cut":false,"hidden":false,"merged":[]}
[]
["CII RT 243 Innovation Maturity Model Evaluation Tool"]
[]
["Tab Descriptions"]
["Raw Scores tab – Use this tab to enter the data from individual surveys."]
["Summary Scores tab – Use this tab to initiate the macros in the spreadsheet and to view a summary of the overall weighted percentages for each of the eight innovation categories."]
["Top Issues tab – Use this tab to see the top ten survey questions. These questions relate to the areas in your organization with the highest potential for improvement of innovation capability. This page also contains brief recommendations for pursuing improvement."]
["Improvement Potential tab – Use this tab to see the improvement potential rating for each of the questions in the survey."]
["IP Rankings tab – Use this tab to see the questions in the survey, ranked according to potential for improvement."]
["Individual Survey tab – This tab shows the text of the survey that should be sent to participants. (Be sure to distribute the IMM Individual Survey spreadsheet so survey participants do not receive all of the other tabs in this file.)"]
{"$rows_left_out":23}
{"sheet":"Raw Scores","index":1,"n_rows":84,"n_cols":38,"rows_kept":84,"cut":false,"hidden":false,"merged":[[60,0,67,0],[70,0,75,0],[78,0,83,0],[1,3,5,4],[9,0,17,0],[20,0,28,0],[31,0,39,0],[42,0,46,0],[49,0,57,0]]}
[]
[null,"CII RT 243 Innovation Maturity Model",null,"Paste individual survey results below, starting with column D and moving to the right until all data has been entered."]
[null,"Use this worksheet to enter the individual survey data."]
[null,"Specifically, copy cells C10-C84 from each individual survey into columns D-W. If more than 20 surveys are collected, simply adjust the range of cells in the average calculation in each of the 61 question rows. "]
[null,"Column D has sample data. Be sure to overwrite these values!"]
[null,"Once you have entered all data, go to the Summary Scores tab."]
[null,null,null,"Resp. 1","Resp. 2","Resp. 3","Resp. 4","Resp. 5","Resp. 6","Resp. 7","Resp. 8","Resp. 9","Resp. 10","Resp. 11","Resp. 12","Resp. 13","Resp. 14","Resp. 15","Resp. 16","Resp. 17","Resp. 18","Resp. 19","Resp. 20","Resp. 21","Resp. 22","Resp. 23","Resp. 24","Resp. 25","Resp. 26","Resp. 27","Resp. 28","Resp. 29","Resp. 30","Resp. 31","Resp. 32","Resp. 33","Resp. 34","Resp. 35"]
[]
[null,"Questions","Average Score"]
["Culture ","Q1. Our organization focuses on long-term relationships with employees at all levels.",{"$f":"AVERAGE(D10:W10)","v":3},3]
{"$rows_left_out":75}
{"sheet":"Summary Scores","index":2,"n_rows":14,"n_cols":5,"rows_kept":14,"cut":false,"hidden":false,"merged":[]}
["Innovation Completion Scores"]
[]
["Click on the black button below to run IMM analysis. "]
[]
[null,"Raw Score","Achievement %","Case Raw Score Comparison","Case Achievement % Comparison"]
["Culture",{"$f":"'Improvement Potential'!I15","v":104},{"$f":"'Improvement Potential'!K15","v":0.6603174603174603},121.05,{"$f":"D6/157.5","v":0.76857142857142857}]
["Resources",{"$f":"'Improvement Potential'!I26","v":119.5},{"$f":"'Improvement Potential'!K26","v":0.69275362318840583},111.27,{"$f":"D7/172.5","v":0.6450434782608695}]
["Risk",{"$f":"'Improvement Potential'!I37","v":110.5},{"$f":"'Improvement Potential'!K37","v":0.63142857142857145},118.3,{"$f":"D8/175","v":0.67599999999999993}]
["Customer",{"$f":"'Improvement Potential'!I44","v":66.5},{"$f":"'Improvement Potential'!K44","v":0.73888888888888893},68.77,{"$f":"D9/90","v":0.76411111111111107}]
["Learning",{"$f":"'Improvement Potential'!I55","v":104},{"$f":"'Improvement Potential'!K55","v":0.67096774193548392},115.21,{"$f":"D10/155","v":0.74329032258064509}]
{"$rows_left_out":5}
{"sheet":"Top Issues","index":3,"n_rows":15,"n_cols":8,"rows_kept":15,"cut":false,"hidden":false,"merged":[]}
[]
[null,"Top Opportunities for Improving Innovation Capability"]
[null,"This list presents the ten questions for which this organization rated the lowest weighted scores and therefore represent the greatest potential for improvement."]
[]
["No.","Question","Average","Max Score","Difference","Weighting","Improvement Potential","Recommendation"]
[{"$f":"'IP Rankings'!A5","v":24},{"$f":"'IP Rankings'!B5","v":"Q24. Failures and mistakes are viewed as opportunities for learning."},{"$f":"'IP Rankings'!C5","v":1},{"$f":"'IP Rankings'!D5","v":5},{"$f":"'IP Rankings'!E5","v":4},{"$f":"'IP Rankings'!F5","v":4},{"$f":"'IP Rankings'!G5","v":16},{"$f":"LOOKUP(A6,Recommendations!$A$2:$A$62,Recommendations!$B$2:$B$62)","v":"A learning organization should be able to turn failures into positive learning experiences. There can be numerous root causes for a failure, but many can be attributed to misapplication, miscommunication, or a poorly understood goal or issue. Furthermore, to achieve a long-term goal or objective the organization may go through many iterations or “failures” before the solution comes into focus. Elevating learning to an organizational priority involves critically assessing an event, engaging the right stakeholders, and recommending the next step of evolution based on the current experience."}]
[{"$f":"'IP Rankings'!A6","v":60},{"$f":"'IP Rankings'!B6","v":"Q60. Our organization has an established process for obtaining corporate funds and resources to support innovation activities."},{"$f":"'IP Rankings'!C6","v":1},{"$f":"'IP Rankings'!D6","v":5},{"$f":"'IP Rankings'!E6","v":4},{"$f":"'IP Rankings'!F6","v":4},{"$f":"'IP Rankings'!G6","v":16},{"$f":"LOOKUP(A7,Recommendations!$A$2:$A$62,Recommendations!$B$2:$B$62)","v":"The most common explanation for a company's lack of innovation is that no time, funding, or resources are devoted to implementing innovation or to changing the way things are done. Project teams are bound to contractual constraints with customers and partners, making it difficult to diverge from the tried and true. Establishing a budget and allowing time for investigating ideas at the company or group level will enable the selection of the best opportunities. If proven out, these opportunities can be proactively implemented on a broader scale."}]
[{"$f":"'IP Rankings'!A7","v":17},{"$f":"'IP Rankings'!B7","v":"Q17. Funding for innovation is available from corporate sources, not just project budgets."},{"$f":"'IP Rankings'!C7","v":2},{"$f":"'IP Rankings'!D7","v":5},{"$f":"'IP Rankings'!E7","v":3},{"$f":"'IP Rankings'!F7","v":5},{"$f":"'IP Rankings'!G7","v":15},{"$f":"LOOKUP(A8,Recommendations!$A$2:$A$62,Recommendations!$B$2:$B$62)","v":"Firms that value innovation as a core value put corporate-level resources in place to fund innovation. A low score in this area indicates a need to consider ways to indemnify project managers with corporate support for innovations proposed at the project level. A second approach to applying corporate funding is to consider spreading costs of expenditures for innovations over multiple projects. Another possible approach is to consider joint ventures with owners, other contractors, or equipment suppliers."}]
[{"$f":"'IP Rankings'!A8","v":37},{"$f":"'IP Rankings'!B8","v":"Q37. Individuals actively share and transfer knowledge."},{"$f":"'IP Rankings'!C8","v":1},{"$f":"'IP Rankings'!D8","v":5},{"$f":"'IP Rankings'!E8","v":4},{"$f":"'IP Rankings'!F8","v":3.5},{"$f":"'IP Rankings'!G8","v":14},{"$f":"LOOKUP(A9,Recommendations!$A$2:$A$62,Recommendations!$B$2:$B$62)","v":"Knowledge that is isolated in a single individual is significantly less valuable to an organization than knowledge that is widely disseminated. Shared knowledge is knowledge that is leveraged my multiple individuals into broader organizational advances. The organization should make it a priority to develop technology that enhances knowledge-sharing, and to create incentives for individuals to share and transfer knowledge to others with similar technical or managerial interests."}]
[{"$f":"'IP Rankings'!A9","v":52},{"$f":"'IP Rankings'!B9","v":"Q52. Leadership demonstrates the belief that innovation is important for attracting and retaining talented young employees."},{"$f":"'IP Rankings'!C9","v":1},{"$f":"'IP Rankings'!D9","v":5},{"$f":"'IP Rankings'!E9","v":4},{"$f":"'IP Rankings'!F9","v":3.5},{"$f":"'IP Rankings'!G9","v":14},{"$f":"LOOKUP(A10,Recommendations!$A$2:$A$62,Recommendations!$B$2:$B$62)","v":"Resources are critical if innovation is to occur. Research has shown that merely encouraging employees to pursue innovation is ineffective because today’s EPC organizations are often so lean that employees can never find the time to pursue innovation activities. Project employees focus all of their time and attention on achieving project goals. Corporate employees focus all of their time on supporting current projects or securing new projects. Resources must be committed by augmenting project budgets with additional staff to pursue innovation on projects. Between projects, corporate staff and field personnel must be given the time and expense budgets to attend conferences and workshops to expand personal and organizational knowledge bases."}]
{"$rows_left_out":6}
{"sheet":"Improvement Potential","index":4,"n_rows":81,"n_cols":11,"rows_kept":81,"cut":false,"hidden":false,"merged":[[2,2,2,4],[66,0,71,0],[74,0,79,0],[5,0,13,0],[16,0,24,0],[27,0,35,0],[38,0,42,0],[45,0,53,0],[56,0,63,0]]}
[null,null,"Innovation Maturity Model"]
[]
[null,null,"RT 243 July 2009 Survey Results"]
[]
[null,null,"Question ","Average","Max Score","Difference","Weighting","Improvement Potential","Weighted Score","Max Score","Acievement Percentage"]
["Culture ",1,"Q1. Our organization focuses on long-term relationships with employees at all levels.",{"$f":"'Raw Scores'!C10","v":3},5,{"$f":"E6-D6","v":2},3,{"$f":"F6*G6","v":6},{"$f":"D6*G6","v":9},{"$f":"E6*G6","v":15}]
[null,2,"Q2. Innovations are discussed freely without regard to rank or position.",{"$f":"'Raw Scores'!C11","v":2},5,{"$f":"E7-D7","v":3},3.5,{"$f":"F7*G7","v":10.5},{"$f":"D7*G7","v":7},{"$f":"E7*G7","v":17.5}]
[null,3,"Q3. Our organization is described as highly collaborative\" by employees, customers, and suppliers.\"",{"$f":"'Raw Scores'!C12","v":4},5,1,4.5,4.5,18,22.5]
[null,4,"Q4. Our organization actively solicits input from outside sources, including suppliers.",{"$f":"'Raw Scores'!C13","v":4},5,1,3.5,3.5,14,17.5]
[null,5,"Q5. Employees at all levels are encouraged to challenge current processes in order to continuously improve them.",{"$f":"'Raw Scores'!C14","v":3},5,2,4,8,12,20]
{"$rows_left_out":72}
{"sheet":"IP Rankings","index":5,"n_rows":79,"n_cols":7,"rows_kept":79,"cut":false,"hidden":false,"merged":[]}
[]
[null,"Ranked Opportunities for Improving Innovation Capability"]
["This list includes all 61 questions ranked by their improvement potential based on the responses provided. "]
["Number","Question ","Average Score","Max Score","Difference","Weighting","Improvement Potential"]
[24,"Q24. Failures and mistakes are viewed as opportunities for learning.",1,5,4,4,16]
[60,"Q60. Our organization has an established process for obtaining corporate funds and resources to support innovation activities.",1,5,4,4,16]
[17,"Q17. Funding for innovation is available from corporate sources, not just project budgets.",2,5,3,5,15]
[37,"Q37. Individuals actively share and transfer knowledge.",1,5,4,3.5,14]
[52,"Q52. Leadership demonstrates the belief that innovation is important for attracting and retaining talented young employees.",1,5,4,3.5,14]
[14,"Q14. Multi-discipline teams (i.e., teams with a mixture of professional backgrounds) are used to identify, analyze, and facilitate the use of innovations.",2,5,3,4,12]
{"$rows_left_out":70}
{"sheet":"Recommendations","index":6,"n_rows":62,"n_cols":2,"rows_kept":62,"cut":false,"hidden":true,"merged":[]}
[]
[1,"Employees have a greater motivation to suggest innovations if they feel secure in their long-term future in the organization. A low score on this question, especially if employee turnover has increased in recent years, may indicate the need for changes in managers’ attitudes and behaviors towards their employees. Specifically, employees may resist innovations if they feel the organization does not have a long-term commitment to retaining them. An investment in management and employee training will likely be required. "]
[2,"All employees must feel comfortable suggesting and commenting on potential innovations, without worrying that more senior employees or managers will be offended by or quash the suggestion. A low score on this question indicates that this comfort level is not apparent in the organization. The organization needs to focus on nurturing innovation development and encouraging collaboration from many individuals of varying ranks and responsibilities. Informal meetings should periodically be held involving multiple levels of personnel focused on identifying and discussing potential innovations and their potential impact. "]
[3,"Innovation is more likely to occur in collaborative organizations for several reasons. First, innovative ideas often come from sources outside of the organization. Collaborative organizations typically lack the “not invented here” syndrome that keeps good ideas from outside sources from being adopted within an organization. Second, innovations often require changing internal processes and processes that involve other organizations. Collaborative organizations are more able to anticipate what is necessary internally and externally to research potential innovations and to implement innovations. Third, collaborative organizations are typically more comfortable managing change because collaborative environments are more dynamic. Increasing the organization’s ability to collaborate is a key factor to achieving a greater level of innovation. "]
[4,"The company-supplier relationship needs to be viewed as a long-term relationship that is important for the success of both organizations. As such, interaction must extend beyond proposal meetings to include periodic meetings that discuss the potential innovations that could mutually improve the performance of both organizations. A low score in this area indicates that this connection does not exist or is perceived not to exist. Informal social interactions may be effective for improving the relationship, but care must be taken that individuals do not lose their objectivity towards the other organization or do not give the appearance of bias."]
[5,"The greatest threat to high-performance organizations is their satisfaction with current operations. Employees within the organization must be encouraged to continuously challenge the status quo in order to examine whether opportunities exist for improvement. Employees throughout the organization must believe the status quo is not good enough because today’s business environment is too dynamic. Formal and informal processes should be established to make it easy for employees to question the way things are done and to seek ways to improve on current processes. "]
[6,"A formal system must exist that requires managers to appropriately respond to employees’ suggestions for process improvement. Such a system should require that employees follow a prescribed process for submitting suggestions, in order to ensure that managers recognize when a suggestion has been made. In turn, the system must require managers to respond to all employees who make suggestions. This form of structured process has been found to be a key element in improving innovation. An investment in a structured process may be required to build confidence in a structured system. "]
[7,"The need for employees to trust their supervisors has been shown to be necessary for achieving a wide range of organizational goals in world-class organizations. Without trust, employees may not feel comfortable suggesting innovations because they fear their suggestions will offend their supervisors, will not be taken seriously, or will be adopted without due credit being giving to them. Building trust throughout the organization may require a long-term and sustained training effort. "]
[8,"Innovation often requires changing not only strictly internal processes but also the processes that involve other organizations. Individuals who routinely cooperate with outside organizations will be more likely to pursue changes that require cooperation by others. Cooperative behavior can result from cultural norms and training initiatives but is most ingrained when the organization formally recognizes and rewards cooperative behavior. "]
[9,"Ideally, all innovations implemented within a firm would result in performance improvements and/or cost reductions that lead to sustainable competitive advantage. However, most innovations associated with the EPC industry are not protected by intellectual property and are not easily hidden from competitors. (This transparency is due to the fact that firms frequently interact with dozens of project subcontractors, who then interact with competitors on subsequent projects.) As such, organizations who do not pursue promising innovations because they fear that competitors may copy them will lose many opportunities to improve their performance. A low score in this area may indicate that this concern is blocking potential innovation. "]
{"$rows_left_out":53}
{"sheet":"Innovation Survey","index":7,"n_rows":90,"n_cols":3,"rows_kept":90,"cut":false,"hidden":false,"merged":[[69,0,74,0],[77,0,82,0],[8,0,16,0],[19,0,27,0],[30,0,38,0],[41,0,45,0],[48,0,56,0],[59,0,66,0]]}
[]
[null,"CII RT 243 Innovation Maturity Model Evaluation Tool"]
[null,"Please use the following scale when answering the each question."]
[null,"1=strongly disagree"]
[null,"2=slightly disagree"]
[null,"3=I am neutral"]
[null,"4=slightly agree","Enter Your Answers"]
[null,"5=strongly agree","Below"]
["Culture ","Q1. Our organization focuses on long-term relationships with employees at all levels."]
[null,"Q2. Innovations are discussed freely without regard to rank or position."]
{"$rows_left_out":81}
{"sheet":"Sheet1","index":8,"n_rows":0,"n_cols":0,"rows_kept":0,"cut":false,"hidden":false,"merged":[]}